{"text_format":"1","workbook":"xlsx","n_sheets":7,"sheets":["Modification Proposals Register","Legal Text Rotation","Lookups","Category KPI","KPI","Annual Report KPI","CACoP Reporting Metrics - Ofgem"],"not_rendered":{"charts":17,"images":0,"macros":1,"external_links":0,"defined_names":11,"comments":2,"pivot_tables":0},"unopened":[],"bounds":{"document_bytes":16777216,"sheet_cells":100000,"rows_first":2000,"rows_last":500,"rows_between":2000,"halvings":0,"cell_chars":16384,"cell_head_chars":4096},"cells_cut":0,"cells_raw":0,"read":"whole","date_system":"1900"}

{"sheet":"Modification Proposals Register","index":0,"n_rows":506,"n_cols":31,"rows_kept":506,"cut":false,"hidden":false,"merged":[[1,0,1,9],[0,0,0,2]]}
[null,null,null,null,null,null,null,null,null,null,null,"*Key Dates are normally an end-date, where shown red this is date sent to Ofgem"]
["Modification Reference Suffix:  A - Alternate,  S - Self Governance,  FT - Fast Track Self Governance,  V - Varied"]
["Mod Ref",null,"Title","Proposing Organisation","Date Raised","Live/ Closed","Category","Other Codes Impacted","Workgroup","Current Status","Next Stage","Key date*","SME",null,"Legal Text Provider","Text Rotation","Text Requested","Text Due","Text Delivered","Std Met","Panel Decision Date","Ofgem Decision Date","ACS",null,null,null,null,null,"Keyword1","Keyword2","Keyword3"]
["0870",null,"Amendments to Wobbe Index and Calorific Value Lower Limits at NTS System National Transmision System (NTS) Entry Points","National Gas Transmission","2024-03-11",{"$f":"VLOOKUP($J4,Lookups!$A$3:$C$20,3,FALSE)","v":"Live"},"Modification",null,"Transmission","Allocated to Workgroup",{"$f":"LOOKUP(J4,Lookups!$A$3:$A$20,Lookups!$B$3:$B$20)","v":"Report to Panel"},"2024-09-19",null,null,"National Gas Transmission","n/a"]
["0869",null,"Revision to the Calculation Methodology of the Security Amount for Planning and Advanced Reservation of Capacity Agreement (PARCA)","National Gas Transmission","2024-03-11",{"$f":"VLOOKUP($J5,Lookups!$A$3:$C$20,3,FALSE)","v":"Live"},"Modification",null,"NTSCMF","Allocated to Workgroup",{"$f":"LOOKUP(J5,Lookups!$A$3:$A$20,Lookups!$B$3:$B$20)","v":"Report to Panel"},"2024-06-29",null,null,"National Gas Transmission","n/a"]
["0868",null,"Change to the current Allocation of Unidentified Gas Statement  frequency","SEFE Energy Limited","2024-02-07",{"$f":"VLOOKUP($J6,Lookups!$A$3:$C$20,3,FALSE)","v":"Live"},"Modification",null,"Other","Allocated to Workgroup",{"$f":"LOOKUP(J6,Lookups!$A$3:$A$20,Lookups!$B$3:$B$20)","v":"Report to Panel"},"2024-08-15",null,null,"Cadent",8]
["0867",null,"Gas Demand Side Response (DSR) Aggregation Arrangements ","National Gas Transmission","2024-01-08",{"$f":"VLOOKUP($J7,Lookups!$A$3:$C$20,3,FALSE)","v":"Live"},"Modification",null,"Transmission","Allocated to Workgroup",{"$f":"LOOKUP(J7,Lookups!$A$3:$A$20,Lookups!$B$3:$B$20)","v":"Report to Panel"},"2024-09-19",null,null,"National Gas Transmission","n/a"]
["0866","S","Amendments to Demand Side Response (DSR) Arrangements ","National Gas Transmission","2024-01-08",{"$f":"VLOOKUP($J8,Lookups!$A$3:$C$20,3,FALSE)","v":"Live"},"Self-Governance",null,"Transmission","Allocated to Workgroup",{"$f":"LOOKUP(J8,Lookups!$A$3:$A$20,Lookups!$B$3:$B$20)","v":"Report to Panel"},"2024-05-16",null,null,"National Gas Transmission","n/a","2024-05-16"]
{"$rows_left_out":499}
{"sheet":"Legal Text Rotation","index":1,"n_rows":24,"n_cols":4,"rows_kept":24,"cut":false,"hidden":false,"merged":[[18,1,18,2],[1,1,1,6]]}
[null,"UNC Text Allocation Register "]
[null,"This Register identifies the Legal Text provider, in column O, for each Modification. Column P 'Rotation' shows who is next using the numerical order in the Transporter list. \n\nTransporter raised Modifications are not subject to this rota and are shown 'n/a (unless they are related to a transmission area in which case the legal text provider is National Gas) as are certain other Modifications not requiring text (e.g Fast Track Modificaitons with Shipper-supplied text and Requests). \n\nColumns P-S on the Register track the delivery of the Legal Text."]
[]
[null,"Rotation","Transporter"]
[null,1,"Scotia Gas Networks"]
[null,2,"Cadent"]
[null,3,"Northern Gas Networks","skipped 3 at 0855 (NGN to take next Shipper Mod [0856?])"]
[null,4,"Cadent"]
{"$rows_left_out":17}
{"sheet":"Lookups","index":2,"n_rows":78,"n_cols":8,"rows_kept":78,"cut":false,"hidden":false,"merged":[[0,0,0,2],[48,0,48,2],[22,0,22,2],[23,0,23,2]]}
["Automated Status Path (must be alphabetical do not edit) "]
["Current Status","Next Stage","Live/Closed",null,"Proposing Organisation List","Category List","Workgroup","Next Stage"]
["Allocated to Workgroup","Report to Panel","Live",null,"Barrow Shipping Ltd","Modification","Distribution","Consultation End"]
["Appeal","Panel Consideration","Live",null,"BG","Request","European","Effective Date"]
["Awaiting Implementation","Implemented","Live",null,"BP","Review","Governance","End of Process"]
["Awaiting Ofgem decision","Ofgem decision","Live",null,"British Gas","Self-Governance","Offtake","Ofgem Decision"]
["Consultation Closed","Final Mod Report","Live",null,"British Gas Trading","Significant Code Review","Performance Assurance ","Report to Panel"]
["Final Mod Report","Panel Consideration","Live",null,"Brook Green Trading","Suspended SCR","Nexus"]
{"$rows_left_out":71}
{"sheet":"Category KPI","index":3,"n_rows":41,"n_cols":17,"rows_kept":41,"cut":false,"hidden":false,"merged":[]}
["*Automated KPI - Do not change anything on this page (including print set) without approval*"]
[]
["Live Modifications YTD Overview Report (Detailed)",null,null,null,null,null,null,null,null,"Live Modifications YTD Overview Report (Summary)"]
[]
["Workgroup","Fast Track","Authority Direction","Request","Self-Governance","Significant Code Review","Urgent","Total",null,"Gas Year","Fast Track","Authority Direction","Request","Self-Governance","Significant Code Review","Urgent","Total"]
["2022-01-01",{"$f":"COUNTIFS('Modification Proposals Register'!$E$3:$E$1083,\">=01/01/2022\",'Modification Proposals Register'!$E$3:$E$1083,\"<=31/01/2022\",'Modification Proposals Register'!$G$3:$G$1083,B$5,'Modification Proposals Register'!$F$3:$F$1083,\"Live\")","v":0},{"$f":"COUNTIFS('Modification Proposals Register'!$E$3:$E$1083,\">=01/01/2022\",'Modification Proposals Register'!$E$3:$E$1083,\"<=31/01/2022\",'Modification Proposals Register'!$G$3:$G$1083,C$5,'Modification Proposals Register'!$F$3:$F$1083,\"Live\")","v":0},{"$f":"COUNTIFS('Modification Proposals Register'!$E$3:$E$1083,\">=01/01/2022\",'Modification Proposals Register'!$E$3:$E$1083,\"<=31/01/2022\",'Modification Proposals Register'!$G$3:$G$1083,D$5,'Modification Proposals Register'!$F$3:$F$1083,\"Live\")","v":0},{"$f":"COUNTIFS('Modification Proposals Register'!$E$3:$E$1083,\">=01/01/2022\",'Modification Proposals Register'!$E$3:$E$1083,\"<=31/01/2022\",'Modification Proposals Register'!$G$3:$G$1083,E$5,'Modification Proposals Register'!$F$3:$F$1083,\"Live\")","v":0},{"$f":"COUNTIFS('Modification Proposals Register'!$E$3:$E$1083,\">=01/01/2022\",'Modification Proposals Register'!$E$3:$E$1083,\"<=31/01/2022\",'Modification Proposals Register'!$G$3:$G$1083,F$5,'Modification Proposals Register'!$F$3:$F$1083,\"Live\")","v":0},{"$f":"COUNTIFS('Modification Proposals Register'!$E$3:$E$1083,\">=01/01/2022\",'Modification Proposals Register'!$E$3:$E$1083,\"<=31/01/2022\",'Modification Proposals Register'!$G$3:$G$1083,G$5,'Modification Proposals Register'!$F$3:$F$1083,\"Live\")","v":0},{"$f":"SUM(B6:G6)","v":0},null,"2021-22",{"$f":"SUM(B6:B14)","v":0},{"$f":"SUM(C6:C14)","v":0},0,0,0,0,{"$f":"SUM(K6:P6)","v":0}]
["2022-02-01",{"$f":"COUNTIFS('Modification Proposals Register'!$E$3:$E$1083,\">=01/02/2022\",'Modification Proposals Register'!$E$3:$E$1083,\"<=28/02/2022\",'Modification Proposals Register'!$G$3:$G$1083,B$5,'Modification Proposals Register'!$F$3:$F$1083,\"Live\")","v":0},{"$f":"COUNTIFS('Modification Proposals Register'!$E$3:$E$1083,\">=01/02/2022\",'Modification Proposals Register'!$E$3:$E$1083,\"<=28/02/2022\",'Modification Proposals Register'!$G$3:$G$1083,C$5,'Modification Proposals Register'!$F$3:$F$1083,\"Live\")","v":0},{"$f":"COUNTIFS('Modification Proposals Register'!$E$3:$E$1083,\">=01/02/2022\",'Modification Proposals Register'!$E$3:$E$1083,\"<=28/02/2022\",'Modification Proposals Register'!$G$3:$G$1083,D$5,'Modification Proposals Register'!$F$3:$F$1083,\"Live\")","v":0},{"$f":"COUNTIFS('Modification Proposals Register'!$E$3:$E$1083,\">=01/02/2022\",'Modification Proposals Register'!$E$3:$E$1083,\"<=28/02/2022\",'Modification Proposals Register'!$G$3:$G$1083,E$5,'Modification Proposals Register'!$F$3:$F$1083,\"Live\")","v":0},{"$f":"COUNTIFS('Modification Proposals Register'!$E$3:$E$1083,\">=01/02/2022\",'Modification Proposals Register'!$E$3:$E$1083,\"<=28/02/2022\",'Modification Proposals Register'!$G$3:$G$1083,F$5,'Modification Proposals Register'!$F$3:$F$1083,\"Live\")","v":0},{"$f":"COUNTIFS('Modification Proposals Register'!$E$3:$E$1083,\">=01/02/2022\",'Modification Proposals Register'!$E$3:$E$1083,\"<=28/02/2022\",'Modification Proposals Register'!$G$3:$G$1083,G$5,'Modification Proposals Register'!$F$3:$F$1083,\"Live\")","v":0},0,null,"2022-23",{"$f":"SUM(B15:B26)","v":0},{"$f":"SUM(C15:C26)","v":0},2,0,0,0,{"$f":"SUM(K7:P7)","v":2}]
["2022-03-01",{"$f":"COUNTIFS('Modification Proposals Register'!$E$3:$E$1083,\">=01/03/2022\",'Modification Proposals Register'!$E$3:$E$1083,\"<=31/03/2022\",'Modification Proposals Register'!$G$3:$G$1083,B$5,'Modification Proposals Register'!$F$3:$F$1083,\"Live\")","v":0},{"$f":"COUNTIFS('Modification Proposals Register'!$E$3:$E$1083,\">=01/03/2022\",'Modification Proposals Register'!$E$3:$E$1083,\"<=31/03/2022\",'Modification Proposals Register'!$G$3:$G$1083,C$5,'Modification Proposals Register'!$F$3:$F$1083,\"Live\")","v":0},{"$f":"COUNTIFS('Modification Proposals Register'!$E$3:$E$1083,\">=01/03/2022\",'Modification Proposals Register'!$E$3:$E$1083,\"<=31/03/2022\",'Modification Proposals Register'!$G$3:$G$1083,D$5,'Modification Proposals Register'!$F$3:$F$1083,\"Live\")","v":0},{"$f":"COUNTIFS('Modification Proposals Register'!$E$3:$E$1083,\">=01/03/2022\",'Modification Proposals Register'!$E$3:$E$1083,\"<=31/03/2022\",'Modification Proposals Register'!$G$3:$G$1083,E$5,'Modification Proposals Register'!$F$3:$F$1083,\"Live\")","v":0},{"$f":"COUNTIFS('Modification Proposals Register'!$E$3:$E$1083,\">=01/03/2022\",'Modification Proposals Register'!$E$3:$E$1083,\"<=31/03/2022\",'Modification Proposals Register'!$G$3:$G$1083,F$5,'Modification Proposals Register'!$F$3:$F$1083,\"Live\")","v":0},{"$f":"COUNTIFS('Modification Proposals Register'!$E$3:$E$1083,\">=01/03/2022\",'Modification Proposals Register'!$E$3:$E$1083,\"<=31/03/2022\",'Modification Proposals Register'!$G$3:$G$1083,G$5,'Modification Proposals Register'!$F$3:$F$1083,\"Live\")","v":0},0,null,"2023-24",{"$f":"SUM(B27:B38)","v":0},{"$f":"SUM(C27:C38)","v":0},0,5,0,0,{"$f":"SUM(K8:P8)","v":5}]
{"$rows_left_out":34}
{"sheet":"KPI","index":4,"n_rows":175,"n_cols":15,"rows_kept":175,"cut":false,"hidden":true,"merged":[[42,0,42,1],[67,0,68,0],[67,1,68,1],[67,13,68,13],[67,12,68,12],[67,11,68,11],[67,10,68,10],[67,9,68,9],[67,8,68,8],[67,7,68,7],[67,6,68,6],[67,5,68,5],[67,4,68,4],[67,3,68,3],[67,2,68,2]]}
["*Automated KPI - Do not change anything on this page (including print set) without approval*"]
[]
["Modification YTD Overview Report "]
[]
["Workgroup","Live Modifications","Oldest"]
["Distribution",{"$f":"COUNTIFS('Modification Proposals Register'!$I$3:$I$1510,A6,'Modification Proposals Register'!$F$3:$F$1510,\"Live\")","v":6},{"$f":"_xlfn.MINIFS('Modification Proposals Register'!$E$3:$E$510,'Modification Proposals Register'!$I$3:$I$510,A6,'Modification Proposals Register'!F$3:F$510,\"Live\")","v":"2022-05-09"},{"$f":"+B6/$B$15","v":0.25}]
["DNCMF",{"$f":"COUNTIFS('Modification Proposals Register'!$I$3:$I$1510,A7,'Modification Proposals Register'!$F$3:$F$1510,\"Live\")","v":0},{"$f":"_xlfn.MINIFS('Modification Proposals Register'!$E$3:$E$510,'Modification Proposals Register'!$I$3:$I$510,A7,'Modification Proposals Register'!F$3:F$510,\"Live\")","v":"00:00:00"},{"$f":"+B7/$B$15","v":0}]
["Transmission",{"$f":"COUNTIFS('Modification Proposals Register'!$I$3:$I$1510,A8,'Modification Proposals Register'!$F$3:$F$1510,\"Live\")","v":6},{"$f":"_xlfn.MINIFS('Modification Proposals Register'!$E$3:$E$510,'Modification Proposals Register'!$I$3:$I$510,A8,'Modification Proposals Register'!F$3:F$510,\"Live\")","v":"2023-07-25"},0.25]
{"$rows_left_out":168}
{"sheet":"Annual Report KPI","index":5,"n_rows":126,"n_cols":20,"rows_kept":126,"cut":false,"hidden":true,"merged":[]}
["*Automated KPI - Do not change anything on this page (including print set) without approval*"]
["Annual Report KPIs"]
[]
[]
["Category","2019-20","2020-21","2021-22","2022-23","2023-24","Total",null,null,null,null,null,null,"Mods by Proposing Organisation","2019-20","2020-21","2021-22","2022-23","2023-24","Total"]
["Fast Track",{"$f":"COUNTIFS('Modification Proposals Register'!$E:$E,\">=01/10/19\",'Modification Proposals Register'!$E:$E,\"<=30/09/20\",'Modification Proposals Register'!$G:$G,$A6)","v":3},{"$f":"COUNTIFS('Modification Proposals Register'!$E:$E,\">=01/10/20\",'Modification Proposals Register'!$E:$E,\"<=30/09/21\",'Modification Proposals Register'!$G:$G,$A6)","v":6},{"$f":"COUNTIFS('Modification Proposals Register'!$E:$E,\">=01/10/21\",'Modification Proposals Register'!$E:$E,\"<=30/09/22\",'Modification Proposals Register'!$G:$G,$A6)","v":3},{"$f":"COUNTIFS('Modification Proposals Register'!$E:$E,\">=01/10/22\",'Modification Proposals Register'!$E:$E,\"<=30/09/23\",'Modification Proposals Register'!$G:$G,$A6)","v":1},{"$f":"COUNTIFS('Modification Proposals Register'!$E:$E,\">=01/10/23\",'Modification Proposals Register'!$E:$E,\"<=30/09/24\",'Modification Proposals Register'!$G:$G,$A6)","v":0},{"$f":"SUM(B6:F6)","v":13},null,null,null,null,null,null,"Aughinish Alumina",{"$f":"COUNTIFS('Modification Proposals Register'!$E:$E,\">=01/10/19\",'Modification Proposals Register'!$E:$E,\"<=30/09/20\",'Modification Proposals Register'!$D:$D,$N6)","v":0},{"$f":"COUNTIFS('Modification Proposals Register'!$E:$E,\">=01/10/20\",'Modification Proposals Register'!$E:$E,\"<=30/09/21\",'Modification Proposals Register'!$D:$D,$N6)","v":0},{"$f":"COUNTIFS('Modification Proposals Register'!$E:$E,\">=01/10/21\",'Modification Proposals Register'!$E:$E,\"<=30/09/22\",'Modification Proposals Register'!$D:$D,$N6)","v":0},{"$f":"COUNTIFS('Modification Proposals Register'!$E:$E,\">=01/10/22\",'Modification Proposals Register'!$E:$E,\"<=30/09/23\",'Modification Proposals Register'!$D:$D,$N6)","v":0},{"$f":"COUNTIFS('Modification Proposals Register'!$E:$E,\">=01/10/23\",'Modification Proposals Register'!$E:$E,\"<=30/09/24\",'Modification Proposals Register'!$D:$D,$N6)","v":0},{"$f":"SUM(O6:S6)","v":0}]
["Modification",{"$f":"COUNTIFS('Modification Proposals Register'!$E:$E,\">=01/10/19\",'Modification Proposals Register'!$E:$E,\"<=30/09/20\",'Modification Proposals Register'!$G:$G,$A7)","v":15},{"$f":"COUNTIFS('Modification Proposals Register'!$E:$E,\">=01/10/20\",'Modification Proposals Register'!$E:$E,\"<=30/09/21\",'Modification Proposals Register'!$G:$G,$A7)","v":19},{"$f":"COUNTIFS('Modification Proposals Register'!$E:$E,\">=01/10/21\",'Modification Proposals Register'!$E:$E,\"<=30/09/22\",'Modification Proposals Register'!$G:$G,$A7)","v":15},{"$f":"COUNTIFS('Modification Proposals Register'!$E:$E,\">=01/10/22\",'Modification Proposals Register'!$E:$E,\"<=30/09/23\",'Modification Proposals Register'!$G:$G,$A7)","v":19},{"$f":"COUNTIFS('Modification Proposals Register'!$E:$E,\">=01/10/23\",'Modification Proposals Register'!$E:$E,\"<=30/09/24\",'Modification Proposals Register'!$G:$G,$A7)","v":6},74,null,null,null,null,null,null,"Barrow Shipping Ltd",{"$f":"COUNTIFS('Modification Proposals Register'!$E:$E,\">=01/10/19\",'Modification Proposals Register'!$E:$E,\"<=30/09/20\",'Modification Proposals Register'!$D:$D,$N7)","v":0},{"$f":"COUNTIFS('Modification Proposals Register'!$E:$E,\">=01/10/20\",'Modification Proposals Register'!$E:$E,\"<=30/09/21\",'Modification Proposals Register'!$D:$D,$N7)","v":2},{"$f":"COUNTIFS('Modification Proposals Register'!$E:$E,\">=01/10/21\",'Modification Proposals Register'!$E:$E,\"<=30/09/22\",'Modification Proposals Register'!$D:$D,$N7)","v":1},{"$f":"COUNTIFS('Modification Proposals Register'!$E:$E,\">=01/10/22\",'Modification Proposals Register'!$E:$E,\"<=30/09/23\",'Modification Proposals Register'!$D:$D,$N7)","v":0},{"$f":"COUNTIFS('Modification Proposals Register'!$E:$E,\">=01/10/23\",'Modification Proposals Register'!$E:$E,\"<=30/09/24\",'Modification Proposals Register'!$D:$D,$N7)","v":0},3]
["Request",{"$f":"COUNTIFS('Modification Proposals Register'!$E:$E,\">=01/10/19\",'Modification Proposals Register'!$E:$E,\"<=30/09/20\",'Modification Proposals Register'!$G:$G,$A8)","v":3},{"$f":"COUNTIFS('Modification Proposals Register'!$E:$E,\">=01/10/20\",'Modification Proposals Register'!$E:$E,\"<=30/09/21\",'Modification Proposals Register'!$G:$G,$A8)","v":5},{"$f":"COUNTIFS('Modification Proposals Register'!$E:$E,\">=01/10/21\",'Modification Proposals Register'!$E:$E,\"<=30/09/22\",'Modification Proposals Register'!$G:$G,$A8)","v":2},{"$f":"COUNTIFS('Modification Proposals Register'!$E:$E,\">=01/10/22\",'Modification Proposals Register'!$E:$E,\"<=30/09/23\",'Modification Proposals Register'!$G:$G,$A8)","v":4},{"$f":"COUNTIFS('Modification Proposals Register'!$E:$E,\">=01/10/23\",'Modification Proposals Register'!$E:$E,\"<=30/09/24\",'Modification Proposals Register'!$G:$G,$A8)","v":0},14,null,null,null,null,null,null,"BP",{"$f":"COUNTIFS('Modification Proposals Register'!$E:$E,\">=01/10/19\",'Modification Proposals Register'!$E:$E,\"<=30/09/20\",'Modification Proposals Register'!$D:$D,$N8)","v":0},{"$f":"COUNTIFS('Modification Proposals Register'!$E:$E,\">=01/10/20\",'Modification Proposals Register'!$E:$E,\"<=30/09/21\",'Modification Proposals Register'!$D:$D,$N8)","v":0},{"$f":"COUNTIFS('Modification Proposals Register'!$E:$E,\">=01/10/21\",'Modification Proposals Register'!$E:$E,\"<=30/09/22\",'Modification Proposals Register'!$D:$D,$N8)","v":0},{"$f":"COUNTIFS('Modification Proposals Register'!$E:$E,\">=01/10/22\",'Modification Proposals Register'!$E:$E,\"<=30/09/23\",'Modification Proposals Register'!$D:$D,$N8)","v":0},{"$f":"COUNTIFS('Modification Proposals Register'!$E:$E,\">=01/10/23\",'Modification Proposals Register'!$E:$E,\"<=30/09/24\",'Modification Proposals Register'!$D:$D,$N8)","v":0},0]
{"$rows_left_out":119}
{"sheet":"CACoP Reporting Metrics - Ofgem","index":6,"n_rows":80,"n_cols":7,"rows_kept":80,"cut":false,"hidden":true,"merged":[[3,9,7,9],[3,10,17,21],[9,2,13,2],[9,3,13,3],[15,2,16,2],[15,3,16,3],[25,3,26,4],[25,5,26,5],[3,2,7,2],[3,3,7,3],[18,2,20,2],[18,3,20,3],[20,10,23,21],[22,2,23,2],[22,3,23,3],[53,3,53,4],[31,2,35,2],[31,3,35,3],[31,10,32,21],[37,2,39,2],[37,3,39,3],[37,10,38,21],[41,2,42,2],[41,3,42,3],[41,10,42,21],[44,2,48,2],[44,3,48,3],[25,2,26,2],[56,2,59,2],[56,3,59,3],[61,2,64,2],[61,3,64,3],[69,2,73,2],[69,3,73,3],[75,2,76,2],[75,3,76,4],[75,5,76,5],[78,2,79,2],[78,3,79,3]]}
[]
[null,null,null,"GENERAL"]
[]
[null,null,1,"Number of modifications raised in the period 01 April to 30 June:\n(Any modifications with alternates should just be counted as 1)","Authority Consent - Non-urgent",{"$f":"COUNTIFS('Modification Proposals Register'!E:E,\">=01/04/22\",'Modification Proposals Register'!E:E,\"<01/07/22\",'Modification Proposals Register'!G:G,\"Modification\")","v":2}]
[null,null,null,null,"Authority Consent - Urgent",{"$f":"COUNTIFS('Modification Proposals Register'!E:E,\">=01/04/22\",'Modification Proposals Register'!E:E,\"<01/07/22\",'Modification Proposals Register'!G:G,\"Urgent\")","v":0}]
[null,null,null,null,"Self-governance",{"$f":"COUNTIFS('Modification Proposals Register'!E:E,\">=01/04/22\",'Modification Proposals Register'!E:E,\"<01/07/22\",'Modification Proposals Register'!G:G,\"Self-Governance\")","v":2}]
[null,null,null,null,"Fast Track self-governance",{"$f":"COUNTIFS('Modification Proposals Register'!E:E,\">=01/04/22\",'Modification Proposals Register'!E:E,\"<01/07/22\",'Modification Proposals Register'!G:G,\"Fast Track\")","v":1}]
[null,null,null,null,"Self-governance - Urgent",{"$f":"COUNTIFS('Modification Proposals Register'!E:E,\">=01/04/22\",'Modification Proposals Register'!E:E,\"<01/07/22\",'Modification Proposals Register'!G:G,\"Urgent\")","v":0}]
{"$rows_left_out":72}