{"text_format":"1","workbook":"xlsx","n_sheets":3,"sheets":["Modification Proposals Register","Lookups","Legal Text Rotation"],"not_rendered":{"charts":0,"images":0,"macros":1,"external_links":0,"defined_names":8,"comments":0,"pivot_tables":0},"unopened":[],"bounds":{"document_bytes":16777216,"sheet_cells":100000,"rows_first":2000,"rows_last":500,"rows_between":2000,"halvings":0,"cell_chars":16384,"cell_head_chars":4096},"cells_cut":0,"cells_raw":0,"read":"whole","date_system":"1900"}

{"sheet":"Modification Proposals Register","index":0,"n_rows":383,"n_cols":23,"rows_kept":383,"cut":false,"hidden":false,"merged":[[1,0,1,9],[0,0,0,2]]}
["UNC Modification Register ",null,null,null,null,null,null,null,null,null,null,"*Key Dates are normally an end-date, where shown red this is date sent to Ofgem"]
["Modification Reference Suffix:  A - Alternate,  S - Self Governance,  FT - Fast Track Self Governance,  V - Varied"]
["Mod Ref",null,"Modification Title","Proposing Organisation","Date Raised","Live/ Closed","Category","Other Codes Impacted","Workgroup","Current Status","Next Stage","Key date*","SME",null,"Legal Text Provider","Text Rotation","Text Requested","Text Due","Text Delivered","Std Met","ACS"]
["0752",null,"Introduction of Weekly Entry Capacity Auction","South Hook Gas Company Ltd","2021-01-11",{"$f":"LOOKUP($J4,Lookups!$A$3:$A$18, Lookups!$C$3:$C$18)","v":"Live"},"Modification",null,"Transmission","Allocated to Workgroup",{"$f":"LOOKUP(J4,Lookups!$A$3:$A$20,Lookups!$B$3:$B$20)","v":"Report to Panel"},"2021-04-15",null,null,"N/A - National Grid","n/a",null,null,null,null,null,{"$f":"IF(AND(F4=\"Live\",K4=\"Ofgem decision\"),\"Yes\",\"No\")","v":"No"}]
["0751",null,"\nCapping price increases for Long-Term Entry Capacity","Storengy UK Ltd","2021-01-11",{"$f":"LOOKUP($J5,Lookups!$A$3:$A$18, Lookups!$C$3:$C$18)","v":"Live"},"Modification",null,"NTS CMF","Allocated to Workgroup",{"$f":"LOOKUP(J5,Lookups!$A$3:$A$20,Lookups!$B$3:$B$20)","v":"Report to Panel"},"2021-04-15",null,null,"N/A - National Grid","n/a",null,null,null,null,null,"No"]
["0750","FT","Amendment to regulations relating to Covid Modifications","Northern Gas Networks","2020-12-14",{"$f":"LOOKUP($J6,Lookups!$A$3:$A$18, Lookups!$C$3:$C$18)","v":"Closed"},"Fast Track",null,"None","Implemented",{"$f":"LOOKUP(J6,Lookups!$A$3:$A$20,Lookups!$B$3:$B$20)","v":"Effective date"},"2021-01-13",null,null,"Northern Gas Networks","n/a","FT - text provided with mod ",null,null,null,null,"No"]
["0749","R","Increased DM SOQ Flexibility","Barrow Shipping Ltd","2020-12-11",{"$f":"LOOKUP($J7,Lookups!$A$3:$A$18, Lookups!$C$3:$C$18)","v":"Live"},"Request",null,"Distribution","Allocated to Workgroup",{"$f":"LOOKUP(J7,Lookups!$A$3:$A$20,Lookups!$B$3:$B$20)","v":"Report to Panel"},"2021-07-15",null,null,"N/A - Request","n/a",null,null,null,null,null,"No"]
["0748",null,"Prospective Removal of Entry Capacity Revenue from Capacity Neutrality Arrangements","National Grid NTS","2020-12-08",{"$f":"LOOKUP($J8,Lookups!$A$3:$A$18, Lookups!$C$3:$C$18)","v":"Closed"},"Urgent",null,"NTS CMF","Implemented",{"$f":"LOOKUP(J8,Lookups!$A$3:$A$20,Lookups!$B$3:$B$20)","v":"Effective date"},"2021-01-01",null,null,"N/A - National Grid","n/a",null,null,null,null,null,"No"]
["0747","FT","Amendment of reference from AIGT to INA within the UNC ","GTC Pipelines Ltd","2020-12-03",{"$f":"LOOKUP($J9,Lookups!$A$3:$A$18, Lookups!$C$3:$C$18)","v":"Closed"},"Fast Track",null,"None","Implemented",{"$f":"LOOKUP(J9,Lookups!$A$3:$A$20,Lookups!$B$3:$B$20)","v":"Effective date"},"2021-01-13",null,null,"Wales & West Utilities",7,null,null,null,null,null,"No"]
["0746 ",null,"Clarificatory change to the AQ amendment process within TPD G2.3","Gazprom Energy","2020-11-19",{"$f":"LOOKUP($J10,Lookups!$A$3:$A$18, Lookups!$C$3:$C$18)","v":"Live"},"Modification",null,"Distribution","Allocated to Workgroup",{"$f":"LOOKUP(J10,Lookups!$A$3:$A$20,Lookups!$B$3:$B$20)","v":"Report to Panel"},"2021-04-15",null,null,"Cadent",null,null,null,null,null,null,"No"]
["0745",null,"Mandatory Setting of Auction Bid Parameters","National Grid NTS","2020-11-12",{"$f":"LOOKUP($J11,Lookups!$A$3:$A$18, Lookups!$C$3:$C$18)","v":"Live"},"Modification",null,"Transmission","Allocated to Workgroup",{"$f":"LOOKUP(J11,Lookups!$A$3:$A$20,Lookups!$B$3:$B$20)","v":"Report to Panel"},"2021-02-18",null,null,"N/A - National Grid","n/a","Panel requested text 21/01/21 ","2021-02-11",null,null,null,"No"]
["0744","FT","Remove redundant reference to NTS Optional Commodity Charges","National Grid NTS","2020-11-06",{"$f":"LOOKUP($J12,Lookups!$A$3:$A$18, Lookups!$C$3:$C$18)","v":"Closed"},"Fast Track",null,"None","Implemented",{"$f":"LOOKUP(J12,Lookups!$A$3:$A$20,Lookups!$B$3:$B$20)","v":"Effective date"},"2020-12-11",null,null,"N/A - National Grid","n/a",null,null,null,null,null,"No"]
["0743","S","Revisions to User Termination Provisions","National Grid NTS","2020-11-06",{"$f":"LOOKUP($J13,Lookups!$A$3:$A$18, Lookups!$C$3:$C$18)","v":"Live"},"Self-Governance",null,"Transmission","Representations invited",{"$f":"LOOKUP(J13,Lookups!$A$3:$A$20,Lookups!$B$3:$B$20)","v":"Consultation end"},"2021-02-11",null,null,"N/A - National Grid","n/a","Panel requested text 21/01/21 ","2021-02-11",null,null,null,"No"]
["0742",null,"Amendment to Gas Quality NTS Entry Specification at the St Fergus SAGE System Entry Point","SAGE North Sea Limited","2020-11-06",{"$f":"LOOKUP($J14,Lookups!$A$3:$A$18, Lookups!$C$3:$C$18)","v":"Live"},"Modification",null,"Transmission","New Proposal",{"$f":"LOOKUP(J14,Lookups!$A$3:$A$20,Lookups!$B$3:$B$20)","v":"Panel Consideration"},"2021-01-21",null,null,"N/A - National Grid","n/a",null,null,null,null,null,"No"]
["0741","S","Updating specific gender references to neutral terms","E.ON UK","2020-10-23",{"$f":"LOOKUP($J15,Lookups!$A$3:$A$18, Lookups!$C$3:$C$18)","v":"Live"},"Self-Governance",null,"Governance","Allocated to Workgroup",{"$f":"LOOKUP(J15,Lookups!$A$3:$A$20,Lookups!$B$3:$B$20)","v":"Report to Panel"},"2021-03-18",null,null,"Cadent",6,null,null,null,null,null,"No"]
["0740 ",null,"0740 - Amending the Formula Year AQ approach for 2021/2 Formula Year","E.ON UK","2020-10-09",{"$f":"LOOKUP($J16,Lookups!$A$3:$A$18, Lookups!$C$3:$C$18)","v":"Closed"},"Modification",null,"none","Withdrawn",{"$f":"LOOKUP(J16,Lookups!$A$3:$A$20,Lookups!$B$3:$B$20)","v":"End of process"},"2020-10-14",null,null,null,null,null,null,null,null,null,"No"]
["0739",null,"Aggregate overrun regime for Original Capacity held at the Bacton ASEPs","ENI","2020-10-05",{"$f":"LOOKUP($J17,Lookups!$A$3:$A$18, Lookups!$C$3:$C$18)","v":"Live"},"Modification",null,"Transmission","Representations invited",{"$f":"LOOKUP(J17,Lookups!$A$3:$A$20,Lookups!$B$3:$B$20)","v":"Consultation end"},"2021-02-11","2021-02-11",null,"N/A - National Grid","n/a","Panel requested text 17/12/20 ","2021-01-12","2021-01-04",null,null,"No"]
["0738",null,"Incremental NTS Entry Capacity Surrender","Barrow Shipping Ltd","2020-10-05",{"$f":"LOOKUP($J18,Lookups!$A$3:$A$18, Lookups!$C$3:$C$18)","v":"Live"},"Modification",null,"Transmission","Panel recommended implementation",{"$f":"LOOKUP(J18,Lookups!$A$3:$A$20,Lookups!$B$3:$B$20)","v":"Ofgem decision"},"2021-01-21",null,null,"N/A - National Grid","n/a","Panel requested Text 19/11/2020",null,null,null,null,"Yes"]
["0737",null,"Transfer of NTS Entry Capacity from a Capacity Abandoned ASEP","Centrica","2020-09-09",{"$f":"LOOKUP($J19,Lookups!$A$3:$A$18, Lookups!$C$3:$C$18)","v":"Live"},"Modification",null,"NTS CMF","Panel did not recommend implementation",{"$f":"LOOKUP(J19,Lookups!$A$3:$A$20,Lookups!$B$3:$B$20)","v":"Ofgem decision"},"2021-01-21",null,null,"N/A - National Grid","n/a","Panel requested Text 19/11/2020",null,null,null,null,"Yes"]
["0736","A","Clarificatory change to the AQ amendment process within TPD G2.3 (Renumbered as 0746)","Gazprom Energy","2020-09-15",{"$f":"LOOKUP($J20,Lookups!$A$3:$A$18, Lookups!$C$3:$C$18)","v":"Closed"},"Modification",null,"Distribution","Withdrawn",{"$f":"LOOKUP(J20,Lookups!$A$3:$A$20,Lookups!$B$3:$B$20)","v":"End of process"},"2020-11-19",null,null,"Cadent","n/a",null,null,null,null,null,"No"]
["0736","S","Clarificatory change to the AQ amendment process within TPD G2.3","Cadent","2020-09-07",{"$f":"LOOKUP($J21,Lookups!$A$3:$A$18, Lookups!$C$3:$C$18)","v":"Closed"},"Modification",null,"Distribution","Implemented",{"$f":"LOOKUP(J21,Lookups!$A$3:$A$20,Lookups!$B$3:$B$20)","v":"Effective date"},"2021-01-14",null,null,"Cadent","n/a","Panel Requested Text\n15/10/2020","2020-11-05",null,null,null,"No"]
["0735","VS","UNC Changes as a consequence of the United Kingdom’s exit from the European Union","National Grid NTS","2021-01-21",{"$f":"LOOKUP($J22,Lookups!$A$3:$A$18, Lookups!$C$3:$C$18)","v":"Live"},"Self-Governance",null,"None","Representations invited",{"$f":"LOOKUP(J22,Lookups!$A$3:$A$20,Lookups!$B$3:$B$20)","v":"Consultation end"},"2021-02-11",null,null,"N/A - National Grid"]
["0735","S","UNC Changes as a consequence of the absence of trade agreement/s between the United Kingdom and the European Union (‘no deal’)","National Grid NTS","2020-09-04",{"$f":"LOOKUP($J23,Lookups!$A$3:$A$18, Lookups!$C$3:$C$18)","v":"Closed"},"Self-Governance",null,"Distribution and Transmission","Withdrawn",{"$f":"LOOKUP(J23,Lookups!$A$3:$A$20,Lookups!$B$3:$B$20)","v":"End of process"},"2021-01-21",null,null,"N/A - National Grid","n/a",null,null,null,null,null,"No"]
["0734","S","Reporting Valid Confirmed Theft of Gas into Central Systems","Gazprom Energy","2020-08-12",{"$f":"LOOKUP($J24,Lookups!$A$3:$A$18, Lookups!$C$3:$C$18)","v":"Live"},"Self-Governance",null,"Distribution","Allocated to Workgroup",{"$f":"LOOKUP(J24,Lookups!$A$3:$A$20,Lookups!$B$3:$B$20)","v":"Report to Panel"},"2021-04-15",null,null,"Scotia Gas Networks",5,null,null,null,null,null,{"$f":"IF(AND(F24=\"Live\",K24=\"Ofgem decision\"),\"Yes\",\"No\")","v":"No"}]
["0733","FT","UNC Section Y clarification post decision on implementation of Modification 0678A","National Grid NTS","2020-08-10",{"$f":"LOOKUP($J25,Lookups!$A$3:$A$18, Lookups!$C$3:$C$18)","v":"Closed"},"Fast Track",null,"None","Implemented",{"$f":"LOOKUP(J25,Lookups!$A$3:$A$20,Lookups!$B$3:$B$20)","v":"Effective date"},"2020-10-01",null,null,"N/A - National Grid","n/a","FT - text provided with mod ",null,null,null,null,"No"]
["0732","FT","Performance Assurance Committee voting arrangements","Wales & West Utilities","2020-08-07",{"$f":"LOOKUP($J26,Lookups!$A$3:$A$18, Lookups!$C$3:$C$18)","v":"Closed"},"Fast Track",null,"None","Implemented",{"$f":"LOOKUP(J26,Lookups!$A$3:$A$20,Lookups!$B$3:$B$20)","v":"Effective date"},"2020-09-14",null,null,"Wales & West Utilites","n/a","FT - text provided with mod ",null,null,null,null,"No"]
["0731","S","Introduction of an Annual Modification Panel Report","Gazprom Energy","2020-08-06",{"$f":"LOOKUP($J27,Lookups!$A$3:$A$18, Lookups!$C$3:$C$18)","v":"Closed"},"Self-Governance",null,"Governance","Implemented",{"$f":"LOOKUP(J27,Lookups!$A$3:$A$20,Lookups!$B$3:$B$20)","v":"Effective date"},"2021-01-13",null,null,"Cadent",4,"Panel Requested Text\n15/10/2020","2020-11-05",null,null,null,"No"]
["0730","V","COVID-19 Capacity Retention Process","Gazprom Energy","2020-12-17","Live","Modification",null,"Distribution","Panel did not recommend implementation",{"$f":"LOOKUP(J28,Lookups!$A$3:$A$20,Lookups!$B$3:$B$20)","v":"Ofgem decision"},"2021-01-21",null,null,"Northern Gas Networks",3]
["0730",null,"COVID-19 Capacity Retention Process","Gazprom Energy","2020-06-30",{"$f":"LOOKUP($J29,Lookups!$A$3:$A$18, Lookups!$C$3:$C$18)","v":"Closed"},"Modification",null,"Distribution","Withdrawn",{"$f":"LOOKUP(J29,Lookups!$A$3:$A$20,Lookups!$B$3:$B$20)","v":"End of process"},"2020-12-17",null,null,"Northern Gas Networks",null,null,null,"2020-07-02",null,null,"No"]
["0729",null,"Applying a discount to the Revenue Recovery Charge at Storage Points","Storengy UK Ltd","2020-06-24",{"$f":"LOOKUP($J30,Lookups!$A$3:$A$18, Lookups!$C$3:$C$18)","v":"Live"},"Modification",null,"NTS CMF","Panel did not recommend implementation",{"$f":"LOOKUP(J30,Lookups!$A$3:$A$20,Lookups!$B$3:$B$20)","v":"Ofgem decision"},"2020-09-17",null,null,"National Grid NTS","n/a","Panel Requested Text\n19/08/2020","2020-08-19","2020-08-19",{"$f":"IF(ISBLANK(S30),\" \",IF(S30<=R30,\"Y\",\"N\"))","v":"Y"},null,"Yes"]
["0728","D","Introduction of Conditional Discounts for Avoiding Inefficient Bypass of the NTS","ENI","2020-06-09",{"$f":"LOOKUP($J31,Lookups!$A$3:$A$18, Lookups!$C$3:$C$18)","v":"Live"},"Urgent",null,"NTS CMF","Panel did not recommend implementation",{"$f":"LOOKUP(J31,Lookups!$A$3:$A$20,Lookups!$B$3:$B$20)","v":"Ofgem decision"},"2020-07-03",null,null,"National Grid NTS","n/a",null,null,null,null,null,"Yes"]
["0728","C","Introduction of a Capacity Discount to Avoid Inefficient Bypass of the NTS","RWE Npower","2020-06-09",{"$f":"LOOKUP($J32,Lookups!$A$3:$A$18, Lookups!$C$3:$C$18)","v":"Live"},"Urgent",null,"NTS CMF","Panel did not recommend implementation",{"$f":"LOOKUP(J32,Lookups!$A$3:$A$20,Lookups!$B$3:$B$20)","v":"Ofgem decision"},"2020-07-03",null,null,"National Grid NTS","n/a",null,null,null,null,null,"Yes"]
["0728","B","Introduction of Conditional Discount for Avoiding Inefficient Bypass of the NTS with 28km distance cap","Vitol SA Geneva","2020-06-09",{"$f":"LOOKUP($J33,Lookups!$A$3:$A$18, Lookups!$C$3:$C$18)","v":"Live"},"Urgent",null,"NTS CMF","Panel did not recommend implementation",{"$f":"LOOKUP(J33,Lookups!$A$3:$A$20,Lookups!$B$3:$B$20)","v":"Ofgem decision"},"2020-07-03",null,null,"National Grid NTS","n/a",null,null,null,null,null,"Yes"]
["0728","A","Introduction of Conditional Discounts for Avoiding Inefficient Bypass of the NTS","South Hook Gas Company Ltd","2020-06-09",{"$f":"LOOKUP($J34,Lookups!$A$3:$A$18, Lookups!$C$3:$C$18)","v":"Live"},"Urgent",null,"NTS CMF","Panel did not recommend implementation",{"$f":"LOOKUP(J34,Lookups!$A$3:$A$20,Lookups!$B$3:$B$20)","v":"Ofgem decision"},"2020-07-03",null,null,"National Grid NTS","n/a",null,null,null,null,null,"Yes"]
["0728",null,"Introduction of a Conditional Discount for Avoiding Inefficient Bypass of the NTS","National Grid NTS","2020-06-09",{"$f":"LOOKUP($J35,Lookups!$A$3:$A$18, Lookups!$C$3:$C$18)","v":"Live"},"Urgent",null,"NTS CMF","Panel did not recommend implementation",{"$f":"LOOKUP(J35,Lookups!$A$3:$A$20,Lookups!$B$3:$B$20)","v":"Ofgem decision"},"2020-07-03",null,null,"National Grid NTS","n/a",null,null,null,null,null,"Yes"]
["0727",null,"Increasing the Storage Transmission Capacity Charge Discount to 80%","Storengy UK ","2020-06-05",{"$f":"LOOKUP($J36,Lookups!$A$3:$A$18, Lookups!$C$3:$C$18)","v":"Closed"},"Urgent",null,"NTS CMF","Implemented",{"$f":"LOOKUP(J36,Lookups!$A$3:$A$20,Lookups!$B$3:$B$20)","v":"Effective date"},"2021-10-01",null,null,"National Grid NTS","n/a",null,null,null,null,null,"No"]
["0726",null,"COVID-19 Liquidity Relief Scheme for Shippers","Wales & West Utilities","2020-06-03",{"$f":"LOOKUP($J37,Lookups!$A$3:$A$18, Lookups!$C$3:$C$18)","v":"Closed"},"Urgent",null,"Distribution","Implemented",{"$f":"LOOKUP(J37,Lookups!$A$3:$A$20,Lookups!$B$3:$B$20)","v":"Effective date"},"2020-06-24",null,null,"Northern Gas Networks","n/a",null,null,null,null,null,"No"]
["0725",null,"Ability to Reflect the Correct Customer Network Use and System Offtake Quantity (SOQ) During COVID-19 ","Gazprom Energy","2020-05-05",{"$f":"LOOKUP($J38,Lookups!$A$3:$A$18, Lookups!$C$3:$C$18)","v":"Closed"},"Urgent",null,"Other","Rejected",{"$f":"LOOKUP(J38,Lookups!$A$3:$A$20,Lookups!$B$3:$B$20)","v":"End of process"},"2020-05-29",null,null,"Northern Gas Networks","n/a",null,null,null,null,null,"No"]
["0724",null,"Amendment to Ratchet charges during COVID-19 period","Northern Gas Networks","2020-04-21",{"$f":"LOOKUP($J39,Lookups!$A$3:$A$18, Lookups!$C$3:$C$18)","v":"Closed"},"Urgent",null,"Distribution","Implemented",{"$f":"LOOKUP(J39,Lookups!$A$3:$A$20,Lookups!$B$3:$B$20)","v":"Effective date"},"2020-05-12",null,null,"Northern Gas Networks","n/a",null,null,null,null,null,"No"]
["0723",null,"Use of the Isolation Flag to identify sites with abnormal load reduction during COVID-19 period","Northern Gas Networks","2020-04-21",{"$f":"LOOKUP($J40,Lookups!$A$3:$A$18, Lookups!$C$3:$C$18)","v":"Closed"},"Urgent",null,"Distribution","Implemented",{"$f":"LOOKUP(J40,Lookups!$A$3:$A$20,Lookups!$B$3:$B$20)","v":"Effective date"},"2020-05-12",null,null,"Northern Gas Networks","n/a",null,null,null,null,null,"No"]
{"$rows_left_out":344}
{"sheet":"Lookups","index":1,"n_rows":78,"n_cols":8,"rows_kept":78,"cut":false,"hidden":false,"merged":[[0,0,0,2],[48,0,48,2],[22,0,22,2],[23,0,23,2]]}
["Automated Status Path (must be alphabetical do not edit) "]
["Current Status","Next Stage","Live/Closed",null,"Proposing Organisation List","Category List","Workgroup","Next Stage"]
["Allocated to Workgroup","Report to Panel","Live",null,"Barrow Shipping Ltd","Modification","Distribution","Consultation End"]
["Appealed","Panel Consideration","Live",null,"BG","Request","European","Effective Date"]
["Consultation Closed","Final Mod Report","Live",null,"BP","Review","Governance","End of Process"]
["Final Mod Report","Panel Consideration","Live",null,"British Gas","Self-Governance","Offtake","Ofgem Decision"]
["Final Mod Report Sent Back by Ofgem","Panel Consideration","Live",null,"British Gas Trading","Significant Code Review","Performance Assurance ","Report to Panel"]
["Implemented","Effective date","Closed",null,"BUUK","Suspended SCR","Nexus"]
["New Proposal","Panel Consideration","Live",null,"Cadent","Urgent","Transmission"]
[null,null,null,null,"Centrica","Timetable Directed","NTS CMF"]
["Panel did not recommend implementation","Ofgem decision","Live",null,"Centrica Storage Ltd","Fast Track","DN CMF"]
["Panel recommended implementation","Ofgem decision","Live",null,"ConocoPhillips",null,"Demand Side Response"]
["Rejected","End of process","Closed",null,"Contract Natural Gas Ltd",null,"Market Operator"]
["Renumbered","End of process","Closed",null,"Corona Energy",null,"None"]
["Representations invited","Consultation end","Live",null,"E.ON UK",null,"Other"]
["Request Closed","End of process","Closed",null,"EDF Energy",null,"UIG"]
["Sent to Ofgem","Ofgem decision","Live",null,"EDF Trading",null,"Distribution and Transmission"]
["Withdrawn","End of process","Closed",null,"Electricity Supply Board"]
[null,null,null,null,"ENI"]
[null,null,null,null,"Energy 24"]
[null,null,null,null,"energywatch"]
[null,null,null,null,"Exxon Mobil"]
["SUGGESTED STATUS PATH",null,null,null,"first:utility"]
[" Reference Purpsoses ONLY",null,null,null,"GasTerra"]
["Current Status","Next Stage","Live/Closed",null,"Gaz de France"]
["New Proposal","Panel Consideration","Live",null,"Gazprom Energy"]
["Allocated to Workgroup","Report to Panel","Live",null,"GTC Pipelines Ltd"]
["Legal Text being prepared?","Report to Panel","Live",null,"ICE Endex "]
["Representations invited","Consultation end","Live",null,"Locus Energy"]
["Consultation Closed","Final Mod Report","Live",null,"Macquarie Bank"]
["Final Mod Report","Panel Consideration","Live",null,"National Grid Gas Distribution"]
["Panel did not recommend implementation","Ofgem decision (date in red)","Live",null,"National Grid NTS"]
["Panel recommended implementation","Ofgem decision (date in red)","Live",null,"National Grid LNG Storage"]
["Implemented","Effective date","Closed",null,"Northern Gas Networks"]
["Final Mod Report Sent Back by Ofgem","Panel Consideration","Live",null,"Npower"]
["Renumbered","End of process","Closed",null,"Opus Energy"]
["Withdrawn","End of process","Closed",null,"RWE Npower"]
["Lapsed?","End of process","Closed",null,"RWE Trading GmbH"]
["Rejected","End of process","Closed",null,"SAGE North Sea Limited"]
["Sent to Ofgem","Ofgem decision","Live",null,"SGN"]
{"$rows_left_out":39}
{"sheet":"Legal Text Rotation","index":2,"n_rows":23,"n_cols":10,"rows_kept":23,"cut":false,"hidden":false,"merged":[[0,9,0,10]]}
["UNC Text Allocation Register ",null,null,null,null,null,null,null,null,"For Mod details"]
[]
[null,null,null,null,null,"Rotation","Transporter"]
["This register identifies the text provider, in column G, for each modification. ",null,null,null,null,1,"Scotia Gas Networks"]
["Column F 'Rotation' shows who is next using the numerical order in the Transporter list.",null,null,null,null,2,"Cadent"]
["Transporter raised modifications are not subject to this rota and are shown 'n/a (unless they are related to a transmission",null,null,null,null,3,"Northern Gas Networks"]
["area in which case the legal text provider is NG) as are certain other modifications not requiring text (eg Fast Track ",null,null,null,null,4,"Cadent"]
["mods with shipper-supplied text  and Requests).",null,null,null,null,5,"Scotia Gas Networks"]
["Columns P-S track the delivery of the text.",null,null,null,null,6,"Cadent"]
[null,null,null,null,null,7,"Wales & West Utilities"]
[null,null,null,null,null,8,"Cadent"]
[null,null,null,null,null,null,"N/A - Enabling Modification"]
[null,null,null,null,null,null,"N/A - National Grid"]
[null,null,null,null,null,null,"N/A - Request"]
[]
[]
[]
[null,"Note: 9/9/19 Mod 0702 assigned same LT provider as Mod 0697 for continuity"]
[]
[]
[]
[]
[null,null,null,null,null,null,null,""]